costume de baptême
created: 2012-07-13T00:00:00+02:00
modified: 2014-10-22T12:17:31+02:00
status: 1
type: Concept
alternative label: robe de baptême
broader: T69-2591
definition: Élément d’habillement, souvent de dentelle blanche, que revêt le baptisé.
in scheme: T69
preferred label: christening gowns @en-us