costume de communion
terme associe: T69-2266
created: 2012-07-13T00:00:00+02:00
modified: 2014-10-22T12:21:50+02:00
status: 1
type: Concept
alternative label: aube de communion
alternative label: robe de communion
broader: T69-2591
definition: Élément d’habillement de couleur blanche, parfois orné de dentelles, que revêt le communiant.
in scheme: T69
related: T69-2266