sonnette de table
created: 2013-01-15T00:00:00+01:00
modified: 2014-10-16T15:21:33+02:00
status: 1
type: Concept
broad match: http://vocab.getty.edu/aat/300041884
broader: T69-4097
definition: Instrument, le plus souvent en forme de cloche, servant à appeler les domestiques et le personnel hôtelier.
in scheme: T69