bénitier
terme associe: T69-1392
terme associe: T69-693
created: 2012-05-16T00:00:00+02:00
modified: 2014-12-01T16:08:19+01:00
status: 1
type: Concept
broader: T69-702
definition: Vasque située, selon les prescriptions liturgiques, près d'une entrée d'église et remplie d'eau bénite avec laquelle les fidèles se signent.
in scheme: T69
preferred label: holy water stoups @en-us
preferred label: acquasantiera @it
preferred label: pia de água benta @pt
related: T69-1392
related: T69-693