lavabo de sacristie
created: 2012-05-16T00:00:00+02:00
modified: 2014-12-01T16:18:43+01:00
status: 1
type: Concept
broader: T69-702
definition: Vasque placée dans la sacristie réservée aux ablutions du célébrant avant et après la messe. On y verse les eaux des purifications ainsi que les résidus de substances bénites après les avoir réduites en cendres.
in scheme: T69
preferred label: sacristy piscinae @en-us
preferred label: lavabo da sacrestia @it
preferred label: lavabo de sacristia @pt