chaire à prêcher
terme associe: T69-2287
terme associe: T69-736
created: 2012-05-16T00:00:00+02:00
modified: 2014-12-01T17:26:43+01:00
status: 1
type: Concept
broader: T69-717
definition: Tribune enclose par un garde-corps et destinée aux clercs pour la prédication. Elle est généralement située à l'intérieur d'une église et peut être fixe ou mobile. Elle comporte souvent un dorsal, un abat-voix et un escalier. Elle peut être recouverte d'un décor de tissu (parement de chaire à prêcher) et entourée d'une clôture.
in scheme: T69
preferred label: pulpits @en-us
preferred label: pulpito @it
preferred label: púlpito @pt
related: T69-2287
related: T69-736