clôture d'autel
created: 2012-05-16T00:00:00+02:00
modified: 2014-12-01T14:28:55+01:00
status: 1
type: Concept
broader: T69-731
definition: Séparation comportant une porte et isolant un autel sur un ou plusieurs côtés. Lorsqu'elle est à hauteur d'appui, elle peut servir de table de communion.
in scheme: T69
preferred label: altar rails @en-us
preferred label: recinzione di altare @it
preferred label: grade de altar @pt