jubé
terme associe: T69-1645
terme associe: T69-6903
created: 2012-05-16T00:00:00+02:00
modified: 2014-12-01T14:45:30+01:00
status: 1
type: Concept
broader: T69-742
definition: Clôture monumentale séparant le chœur liturgique de la nef et servant aussi à lire l'Evangile. Le jubé comporte souvent deux petits autels de part et d'autre de l'entrée, une plate-forme et une coursière généralement surmontée d'une croix ou d'un calvaire.
in scheme: T69
preferred label: rood screens @en-us
preferred label: pontile @it
preferred label: jubéu @pt
related: T69-1645
related: T69-6903