clôture de dévotion
created: 2012-05-16T00:00:00+02:00
modified: 2014-12-01T14:48:22+01:00
status: 1
type: Concept
alternative label: clôture de relique
broad match: Clôture
broad match: http://vocab.getty.edu/aat/300003724
broader: T69-731
definition: Séparation – souvent une grille métallique avec une porte - protégeant et séparant du reste d'une église une œuvre de taille importante, objet d'une vénération particulière.
in scheme: T69
preferred label: devotional object railing @en-us
preferred label: recinzione di monumento devozionale @it
preferred label: grade de monumento devocional @pt