clôture de monument funéraire
terme associe: T69-377
created: 2012-05-16T00:00:00+02:00
modified: 2014-12-01T14:52:21+01:00
status: 1
type: Concept
broad match: http://vocab.getty.edu/aat/300005926
broader: T69-731
definition: Séparation comportant souvent une porte et permettant d'isoler un monument funéraire du reste d'une église ou d'un cimetière.
in scheme: T69
preferred label: tomb railings @en-us
preferred label: recinzione di monumento funebre @it
preferred label: grade de monumento funerário @pt
related: T69-377