placard-clôture des fonts baptismaux
terme associe: T69-686
terme associe: T69-688
created: 2012-05-16T00:00:00+02:00
modified: 2014-12-01T14:58:13+01:00
status: 1
type: Concept
broad match: http://vocab.getty.edu/aat/300080617
broader: T69-760
definition: Placard contenant la cuve des fonts baptismaux. Le plus souvent en saillie partielle sur le mur, il ferme à clef, sert à la fois de clôture des fonts baptismaux, d'armoire aux saintes huiles et de baldaquin des fonts baptismaux.
in scheme: T69
preferred label: baptismal font enclosures @en-us
preferred label: armadio del fonte battesimale @it
preferred label: armário de pia baptismal @pt
related: T69-686
related: T69-688