meuble lié à l'offrande
created: 2012-05-16T00:00:00+02:00
modified: 2014-12-01T17:02:46+01:00
status: 1
type: Concept
broad match: http://data.bnf.fr/ark:/12148/cb131627054
broader: T69-577
definition: Mobilier destiné à la collecte, au transport ou à la distributrion des offrandes.
in scheme: T69
narrower: T69-767
narrower: T69-770
narrower: T69-776
narrower: T69-778
preferred label: furniture and furnishings for offerings @en-us
preferred label: arredi per l'offerta @it
preferred label: mobiliário relacionado com oferendas @pt