monnaie
terme associe: T69-4851
created: 2013-07-19T00:00:00+02:00
modified: 2014-12-30T12:37:52+01:00
status: 1
type: Concept
broader: T69-9392
definition: Pièce de titre, forme et poids caractéristiques, frappée d'une particulière, garantie par l'autorité d'émission comme moyen légal d'échange, de paiement et d'épargne.
in scheme: T69
preferred label: coins (money) @en-us
related: T69-4851