médaille
terme associe: T69-4851
created: 2013-07-19T00:00:00+02:00
modified: 2014-12-30T12:36:25+01:00
status: 1
type: Concept
alternative label: médaillon
broader: T69-9392
definition: <!--[if gte mso 9]> <o:OfficeDocumentSettings> <o:AllowPNG/> </o:OfficeDocumentSettings> <![endif]-->Pièce fabriquée en l'honneur d'un personnage illustre, dont elle porte l'effigie, ou en souvenir d'un événement, d'une action mémorable, d'un lieu, etc.
in scheme: T69
preferred label: medals @en-us
related: T69-4851