bijou
terme associe: T69-1706
terme associe: T69-2123
terme associe: T69-3539
terme associe: T69-9379
created: 2013-07-19T00:00:00+02:00
modified: 2014-12-30T12:31:29+01:00
status: 1
type: Concept
alternative label: bijou de parure
alternative label: boucle d'oreille
alternative label: bracelet
alternative label: breloque
alternative label: broche
alternative label: pendant d'oreille
alternative label: pendentif
broader: T69-9371
definition: Élément de parure, précieux par ses matériaux, sa mise en œuvre, son décor ou encore son originalité, qui se porte sur le corps ou le vêtement.
in scheme: T69
narrower: T69-9380
narrower: T69-9383
preferred label: jewelry @en-us
related: T69-1706
related: T69-2123
related: T69-3539
related: T69-9379