sculpture cinétique
terme associe: T69-4956
created: 2013-07-19T00:00:00+02:00
modified: 2014-10-17T16:32:28+02:00
status: 1
type: Concept
alternative label: mobile
alternative label: stabile
broader: T69-4825
definition: Œuvre à laquelle on donne le mouvement pour principe, accompagné ou non d'un jeu de lumière, afin d'obtenir un ensemble changeant. Ce mouvement est produit de manière plus ou moins complexe, intervention du spectateur, mécanisme, moteur, courant d'air, etc.
in scheme: T69
preferred label: kinetic sculptures @en-us
related: T69-4956