sculpture constructiviste
created: 2013-07-19T00:00:00+02:00
modified: 2014-10-17T16:34:12+02:00
status: 1
type: Concept
broader: T69-4825
definition: Œuvre obtenue en ordonnant des éléments généralement géométriques composés de différents matériaux (bois, fer, carton, etc.), selon des principes rigoureux.
in scheme: T69
preferred label: constructions (sculpture) @en-us