collage
created: 2013-07-22T00:00:00+02:00
modified: 2014-12-03T16:02:34+01:00
status: 1
type: Concept
broader: T69-4880
definition: Peinture ou dessin principalement constitué d'objets plats collés sur un support plat.
in scheme: T69
preferred label: collages (visual works) @en-us