régulateur
created: 2013-09-16T00:00:00+02:00
modified: 2015-08-06T17:03:22+02:00
status: 1
type: Concept
broader: T69-6028
definition: Organe mécanique ou électrotechnique, généralement installé entre le générateur et le moteur, permettant de maintenir constant et régulier un débit énergétique afin d'éviter l'emballement du moteur ou la surchauffe du générateur.
in scheme: T69