corbillard
terme associe: T69-2354
terme associe: T69-2364
created: 2013-09-18T00:00:00+02:00
modified: 2014-12-30T12:09:17+01:00
status: 1
type: Concept
broader: T69-8863
definition: Véhicule destiné au transport d'un cercueil lors de la cérémonie funéraire ; il comporte le plus souvent une garniture textile. Autrefois tracté par des hommes ou des animaux, il est désormais automobile.
in scheme: T69
preferred label: hearses @en-us
related: T69-2354
related: T69-2364