armoire de confrérie, de congrégation ou de fabrique
terme associe: T69-2843
terme associe: T69-2881
terme associe: T69-3105
created: 2012-05-16T00:00:00+02:00
modified: 2014-12-01T15:14:01+01:00
status: 1
type: Concept
alternative label: armoire de confrérie
alternative label: armoire de congrégation
alternative label: armoire de fabrique
broader: T69-858
definition: Armoire servant à conserver les biens d'une confrérie, d'une congrégation ou d'une fabrique. Elle se caractérise par la présence de deux ou trois serrures différentes dont les clés sont détenues par des membres distincts. Une inscription ou une iconographie en indique parfois l'appartenance.
in scheme: T69
preferred label: confraternity, congregation or parish cupboards @en-us
preferred label: armadio di confraternita e fabbriceria @it
preferred label: armário de confraria e da fábrica @pt
related: T69-2843
related: T69-2881
related: T69-3105