orgue portatif
created: 2013-10-31T00:00:00+01:00
modified: 2014-10-10T12:30:40+02:00
status: 1
type: Concept
alternative label: orgue positif
alternative label: polyphone
broader: T69-9893
definition: Orgue transportable disposant d’un seul clavier et d’un ou plusieurs jeux où l'air y est envoyé par des soufflets actionnés par une seconde personne, le souffleur.
in scheme: T69
preferred label: portative organs @en-us
preferred label: organo portativo @it