bateau phare
created: 2013-11-04T00:00:00+01:00
modified: 2014-12-19T16:42:47+01:00
status: 1
type: Concept
alternative label: bateau-feu
broader: T69-6351
definition: Bateau mouillé en un point déterminé qui porte un phare aidant à la navigation.
in scheme: T69
preferred label: lightships @en-us