balise maritime
created: 2013-11-04T00:00:00+01:00
modified: 2014-12-19T16:40:59+01:00
status: 1
type: Concept
alternative label: bouée de signalisation
alternative label: bouée hydrographique
alternative label: bouée météorologique
alternative label: bouée océanographique
broader: T69-6351
definition: Matériel flottant ancré servant à des mesures scientifiques, de repère, de signal ou de marque de parcours.
in scheme: T69
preferred label: buoys @en-us