figure de proue
created: 2013-11-04T00:00:00+01:00
modified: 2014-12-19T16:18:54+01:00
status: 1
type: Concept
broader: T69-8773
definition: Elément sculpté décoratif ornant l'avant d'un navire.
in scheme: T69
preferred label: prow ornaments @en-us