charpente de toit
created: 2012-05-16T00:00:00+02:00
modified: 2014-12-15T15:32:43+01:00
status: 1
type: Concept
alternative label: charpente d'assemblage
alternative label: charpente à la Philibert de L'Orme
broad match: http://data.bnf.fr/ark:/12148/cb11977467c
broader: T69-86
definition: Ensemble des pièces de charpente en bois ou en fer, formant le toit et portant le matériau de couverture.
in scheme: T69
preferred label: roof frames @en-us
scope note: Voir aussi le Thesaurus de la désignation des œuvres architecturales et des espaces aménagés.