véhicule à énergie animale
created: 2013-11-05T00:00:00+01:00
modified: 2014-12-30T11:42:50+01:00
status: 1
type: Concept
alternative label: voiture hippomobile
broader: T69-8850
definition: Véhicule terrestre faisant appel aux forces des énergies animales, principalement des équidés.
in scheme: T69
narrower: T69-8887
narrower: T69-8905
narrower: T69-8906
narrower: T69-8907
preferred label: horse-drawn vehicles @en-us