selle de cavalier ou ses accessoires
created: 2013-11-05T00:00:00+01:00
modified: 2014-12-30T11:27:46+01:00
status: 1
type: Concept
alternative label: arçon
alternative label: étrier
alternative label: étrivière
broader: T69-8907
definition: Pièce incurvée, principalement en cuir, qui, placée sur le dos de la monture, sert de siège au cavalier.
in scheme: T69
preferred label: saddles (seats) @en-us