fouet
created: 2013-11-05T00:00:00+01:00
modified: 2014-12-30T11:20:43+01:00
status: 1
type: Concept
alternative label: cravache
broader: T69-8907
definition: Instrument fait d'une corde ou d'une lanière de cuir attachée à un manche servant à conduire et stimuler les chevaux et autres animaux de trait ou d'attelage.
in scheme: T69
preferred label: whips (animal equipment) @en-us