triporteur
created: 2013-11-06T00:00:00+01:00
modified: 2014-10-16T11:55:00+02:00
status: 1
type: Concept
broad match: http://data.bnf.fr/ark:/12148/cb11975775b
broader: T69-8863
definition: Tricycle à pédales ou à moteur muni d'une caisse pour le transport sur de petites distances des marchandises légères.
in scheme: T69
preferred label: three-wheelers @en-us