véhicule de lutte contre l'incendie
terme associe: T69-5705
created: 2013-11-06T00:00:00+01:00
modified: 2014-12-30T12:12:21+01:00
status: 1
type: Concept
alternative label: camion de pompier
alternative label: pompe à incendie
alternative label: véhicule moto-pompe
alternative label: véhicule échelle
broader: T69-8863
definition: Véhicule doté d'équipements nécessaires à la lutte contre le feu (pompe, réservoir, échelle, lance à incendie, etc.) et le plus souvent peint en rouge.
in scheme: T69
preferred label: firefighting vehicles @en-us
related: T69-5705