armoire à reliquaires
terme associe: T69-1713
created: 2012-05-16T00:00:00+02:00
modified: 2014-12-01T15:37:26+01:00
status: 1
type: Concept
broader: T69-904
definition: Meuble destiné à la conservation et à l'exposition des reliquaires. L’armoire à reliquaires doit être solidement fermée et peut comporter une inscription qui précise sa destination.
in scheme: T69
preferred label: reliquary cupboards @en-us
preferred label: armadio per reliquari @it
preferred label: armário para relicários @pt
related: T69-1713