pavillon de suspension eucharistique
created: 2013-11-12T00:00:00+01:00
modified: 2014-12-01T16:41:49+01:00
status: 1
type: Concept
alternative label: dais de suspension eucharistique
broad match: http://data.bnf.fr/ark:/12148/cb119489917
broader: T69-648
definition: Ouvrage, généralement de plan circulaire, souvent en tissu, accroché à une suspension eucharistique au-dessus de la réserve.
in scheme: T69
preferred label: hanging pyx canopies @en-us
preferred label: baldacchino della sospensione eucaristica @it
preferred label: pavilhão de suspensão eucarística @pt