croix pectorale orthodoxe
created: 2013-11-12T00:00:00+01:00
modified: 2014-01-10T00:00:00+01:00
status: 1
type: Concept
broader: T69-2103
definition: Insigne de dignité en forme de croix, suspendue autour du cou, portée par les aux hauts dignitaires du clergé orthodoxe. Généralement en métal précieux, elle peut être assortie à l’anneau pastoral.
in scheme: T69