meuble de sacristie
created: 2012-05-16T00:00:00+02:00
modified: 2014-12-01T15:47:57+01:00
status: 1
type: Concept
alternative label: armoire de sacristie
alternative label: armoire de sacristie-chapier
alternative label: armoire de sacristie-chasublier
alternative label: coffre de sacristie
alternative label: placard de sacristie
alternative label: table de sacristie
broader: T69-904
definition: Meuble ou association de meubles placé dans la sacristie d'une église et servant à ranger les objets du culte ainsi que les vêtements, linges, garnitures, etc. ou à d'autres fonctions liturgiques. Il peut être accompagné d'un confessionnal, d'un prie-Dieu de sacristie, etc.
in scheme: T69
preferred label: sacristy furniture @en-us
preferred label: mobilia da sacrestia @it
preferred label: móvel de sacristia @pt