vêtement spécifique de militaire
terme associe: T69-8158
terme associe: T69-9165
terme associe: T69-9181
terme associe: T69-9979
created: 2013-11-13T00:00:00+01:00
modified: 2014-12-11T17:02:48+01:00
status: 1
type: Concept
alternative label: uniforme militaire
broader: T69-6461
definition: Vêtement ou ensemble de pièces, de coupe et de couleur réglementaires imposés pour exercer des fonctions ou activités militaires.
in scheme: T69
preferred label: military uniforms @en-us
related: T69-8158
related: T69-9165
related: T69-9181
related: T69-9979