porte-chape
created: 2012-05-16T00:00:00+02:00
modified: 2014-12-01T15:49:55+01:00
status: 1
type: Concept
broader: T69-904
definition: Grand cintre sur pied sur lequel l’officiant suspend temporairement ses vêtements avant et après une cérémonie.
in scheme: T69
preferred label: cope stands @en-us
preferred label: portapiviale @it
preferred label: cabide para capas @pt