linge domestique
created: 2013-11-14T00:00:00+01:00
modified: 2014-12-12T12:36:37+01:00
status: 1
type: Concept
alternative label: bavoir
alternative label: chemin de table
alternative label: drap
alternative label: gant de toilette
alternative label: linge de cuisine
alternative label: linge de lit
alternative label: linge de table
alternative label: linge de toilette
alternative label: nappe
alternative label: serviette de table
alternative label: serviette de toilette
alternative label: taie d'oreiller
broader: T69-6546
definition: Pièce de tissu nécessaire aux divers moments et besoins de la vie domestique. Il peut s'agir d'un linge de table, d'un linge de lit, d'un linge de toilette, d'un linge de cuisine, etc.
in scheme: T69
preferred label: linens (textile works) @en-us