costume d'animal
created: 2013-11-14T00:00:00+01:00
modified: 2014-10-20T10:28:38+02:00
status: 1
type: Concept
alternative label: caparaçon
alternative label: muselière
broader: T69-6461
definition: Parure destinée à un animal (chien, cheval, etc.).
in scheme: T69
narrow match: http://data.bnf.fr/ark:/12148/cb15625802d
preferred label: animal trappings @en-us