écharpe
terme associe: T69-2562
created: 2013-11-14T00:00:00+01:00
modified: 2014-12-11T16:20:04+01:00
status: 1
type: Concept
broader: T69-6462
definition: Pièce d'étoffe rectangulaire portée sur le manteau ou la veste ou dans l'encolure de ceux-ci permettant de se protéger du froid et servant d'ornement.
in scheme: T69
preferred label: scarves (costume accessories) @en-us
related: T69-2562