meuble lié aux rites funéraires
terme associe: T69-1520
terme associe: T69-377
created: 2012-05-16T00:00:00+02:00
modified: 2014-12-02T10:38:09+01:00
status: 1
type: Concept
broader: T69-577
definition: Mobilier ou support lié au transport ou à l’exposition du défunt au moment d’une cérémonie funéraire.
in scheme: T69
narrower: T69-927
narrower: T69-929
narrower: T69-931
narrower: T69-933
narrower: T69-935
narrower: T69-939
narrower: T69-941
narrower: T69-942
narrower: T69-946
preferred label: funeral furniture @en-us
preferred label: arredi funebri @it
preferred label: mobiliário funerário @pt
related: T69-1520
related: T69-377