casque
created: 2013-11-14T00:00:00+01:00
modified: 2014-12-10T18:11:54+01:00
status: 1
type: Concept
alternative label: helmets @en-us
broader: T69-6527
definition: Coiffure rigide destinée à protéger la tête de celui qui la porte. Le casque est souvent muni d'une jugulaire ou d'une mentonnière.
in scheme: T69