vêtement spécifique de sportif
terme associe: T69-9410
created: 2013-11-14T00:00:00+01:00
modified: 2014-12-12T10:25:05+01:00
status: 1
type: Concept
alternative label: caleçon de bain
alternative label: maillot de bain
alternative label: tenue de sport
broader: T69-6461
definition: Vêtement ou ensemble de pièces, de coupe et de couleur organisés, utilisés pour pratiquer un sport, notamment dans le cadre de compétition.
in scheme: T69
preferred label: sports clothing @en-us
related: T69-9410