accessoire de l'habillement
terme associe: T69-9371
created: 2013-11-14T00:00:00+01:00
modified: 2014-10-17T16:42:33+02:00
status: 1
type: Concept
alternative label: couronne de chignon
alternative label: couronne de costume de mariée
alternative label: embauchoir
alternative label: manchon
alternative label: ombrelle
alternative label: parapluie
alternative label: porte-clefs
alternative label: porte-monnaie
broader: T69-6461
definition: Élément de forme et de fonction variées qui accompagne et complète les pièces du vêtement, généralement pour sortir, et qui peut être assortie à celles-ci.
in scheme: T69
narrower: T69-6543
narrower: T69-6549
narrower: T69-9321
narrower: T69-9330
narrower: T69-9331
narrower: T69-9332
preferred label: costume accessories @en-us
related: T69-9371