éventail
created: 2013-11-14T00:00:00+01:00
modified: 2014-12-10T17:55:01+01:00
status: 1
type: Concept
broader: T69-9317
definition: Accessoire de matière légère (papier, tissu, plume, etc.), souvent de formes semi-circulaire, monté sur des lames mobiles qui se replient les unes sur les autres, servant à éventer dans le but de rafraîchir.
in scheme: T69
preferred label: fans (costume accessories) @en-us