lunettes
terme associe: T69-5369
created: 2013-11-14T00:00:00+01:00
modified: 2014-12-10T17:56:13+01:00
status: 1
type: Concept
alternative label: binocles
alternative label: bésicles
alternative label: face-à-main
alternative label: lorgnon
alternative label: lunettes de soleil
alternative label: monocle
alternative label: pince-nez
broader: T69-9317
definition: Instrument permettant de pallier les défauts visuels ou de se protéger les yeux. Les lunettes sont le plus souvent constituées d'une monture (aux formes décoratives et couleurs multiples), qui repose sur le nez et sur laquelle les verres sont fixés.
in scheme: T69
preferred label: eyeglasses @en-us
related: T69-5369