bagage
created: 2013-11-14T00:00:00+01:00
modified: 2014-12-10T17:52:33+01:00
status: 1
type: Concept
alternative label: sac de voyage
alternative label: valise
broader: T69-9317
definition: Valise, sac, malle qui contient les objets ou les effets que l'on emporte avec soi en voyage ou en déplacement.
in scheme: T69
preferred label: luggage @en-us