couronne royale
terme associe: T69-1706
terme associe: T69-7960
created: 2013-11-29T00:00:00+01:00
modified: 2014-10-09T12:54:21+02:00
status: 1
type: Concept
broader: T69-9388
definition: <!--[if gte mso 9]> <o:OfficeDocumentSettings> <o:AllowPNG/> </o:OfficeDocumentSettings> <![endif]-->Objet circulaire de métal précieux souvent orné de pierreries, que le souverain porte sur sa tête comme insigne de sa puissance et de sa dignité.
in scheme: T69
preferred label: royal crowns @en-us
related: T69-1706
related: T69-7960