bague
terme associe: T69-1818
terme associe: T69-9382
created: 2013-11-29T00:00:00+01:00
modified: 2014-12-30T12:26:17+01:00
status: 1
type: Concept
alternative label: alliance
broader: T69-7960
definition: Bijou qui se porte au doigt, constitué d’un anneau, souvent en métal précieux, qui est parfois serti de pierres.
in scheme: T69
preferred label: rings (jewelry) @en-us
related: T69-1818
related: T69-9382