accessoire de jeu de société
terme associe: T69-9393
created: 2013-11-29T00:00:00+01:00
modified: 2014-12-30T13:07:57+01:00
status: 1
type: Concept
alternative label: dé à jouer
alternative label: pion de jeu
alternative label: tapis de jeu
broad match: Jeu de société
broader: T69-6376
definition: Élément ou ensemble incomplet d'éléments utilisés dans un jeu de société.
in scheme: T69
preferred label: board game elements @en-us
related: T69-9393